{"text_format":"1","workbook":"xlsx","n_sheets":4,"sheets":["Schedules","Project Details","Calculations","Lookups"],"not_rendered":{"charts":0,"images":1,"macros":1,"external_links":1,"defined_names":14,"comments":0,"pivot_tables":0},"unopened":[],"bounds":{"document_bytes":16777216,"sheet_cells":100000,"rows_first":2000,"rows_last":500,"rows_between":2000,"halvings":0,"cell_chars":16384,"cell_head_chars":4096},"cells_cut":0,"cells_raw":0,"read":"whole","date_system":"1900"}

{"sheet":"Schedules","index":0,"n_rows":26,"n_cols":11,"rows_kept":26,"cut":false,"hidden":false,"merged":[[2,2,2,3],[2,4,2,8],[2,9,2,10]]}
["Operating Schedules"]
[]
[null,null,"Annual",null,"Weekday Hours Per day (up to 24)",null,null,null,null,"Weekend Hours Per Day (up to 24)"]
[" Schedule","Annual     Hours","Weeks","Weekends","Monday","Tuesday","Wednesday","Thursday","Friday","Saturday","Sunday"]
[{"$f":"\"Sched_1\"","v":"Sched_1"},{"$f":"(SUM(E5:I5)*C5)+(SUM(J5:K5)*D5)","v":0},52,52]
[{"$f":"\"Sched_2\"","v":"Sched_2"},{"$f":"(SUM(E6:I6)*C6)+(SUM(J6:K6)*D6)","v":0},52,52]
[{"$f":"\"Sched_3\"","v":"Sched_3"},{"$f":"(SUM(E7:I7)*C7)+(SUM(J7:K7)*D7)","v":0},52,52]
[{"$f":"\"Sched_4\"","v":"Sched_4"},{"$f":"(SUM(E8:I8)*C8)+(SUM(J8:K8)*D8)","v":0},52,52]
["Sched_5",0,52,52]
["Sched_6",0,52,52]
["Sched_7",0,52,52]
[{"$f":"\"Sched_8\"","v":"Sched_8"},0,52,52]
[{"$f":"\"Sched_9\"","v":"Sched_9"},0,52,52]
["Sched_10",0,52,52]
[]
{"$rows_left_out":12}
{"sheet":"Project Details","index":1,"n_rows":386,"n_cols":24,"rows_kept":386,"cut":false,"hidden":false,"merged":[[12,11,12,12],[12,8,12,9],[11,8,11,10],[14,4,14,10],[6,14,7,20],[77,15,78,17],[63,2,63,20],[65,13,66,13],[65,14,66,16],[65,6,66,6],[65,7,66,12],[77,7,78,8],[77,10,78,12],[77,14,78,14],[11,2,11,3],[12,2,12,3],[12,14,12,16],[14,11,14,17],[11,4,11,6],[12,4,12,6]]}
[]
[]
[]
[]
[null,null,null,null,null,null,null,null,null,null,null,null,"Date:"]
[]
[null,null,null,null,null,null,null,null,null,null,null,null,null,null,"Select 100% for the rebate cap if the project is for a multi-family, school, non-profit, or governmental agency facility.  "]
[null,null,null,null,null,null,null,null,null,null,null,null,"Cap:",0.5]
[]
[null,null,null,null,null,null,null,null,null,null,null,null,"Cost Per kWh:",{"$f":"AVERAGE(0.1718,0.2181)","v":0.19495000000000001}]
[]
[null,null,"Business Name:",null,null,null,null,"Site Address:",null,null,null,"City:","Healdsburg","State:","CA","Zip:",95448]
[null,null,"Contact Name:",null,null,null,null,"Phone:",null,null,"Business Type:",null,null,"Describe (if Other):"]
[]
[null,null,null,null,"Pre-Existing Condition",null,null,null,null,null,null,"Post-Condition (New Equipment)"]
{"$rows_left_out":372}
{"sheet":"Calculations","index":2,"n_rows":38,"n_cols":34,"rows_kept":38,"cut":false,"hidden":true,"merged":[]}
[]
[]
[{"$f":"'Project Details'!C16","v":"Fixture Location"},{"$f":"'Project Details'!E16","v":"Fixture Type Before Retrofit"},{"$f":"'Project Details'!G16","v":"Fixture Before Retrofit"},{"$f":"'Project Details'!H16","v":"Baseline Wattage Per Fixture Before Retrofit"},{"$f":"'Project Details'!I16","v":"# Fixtures Before Retrofit"},null,null,{"$f":"'Project Details'!K16","v":"Annual Hours of Operation Before Retrofit"},"Annual kWh Before Retrofit",{"$f":"'Project Details'!L16","v":"Fixture Type After Retrofit"},{"$f":"'Project Details'!M16","v":"Fixture After Retrofit"},{"$f":"'Project Details'!O16","v":"Watts Per Fixture After Retrofit"},{"$f":"'Project Details'!P16","v":"# Fixtures After Retrofit"},null,null,{"$f":"'Project Details'!R16","v":"Annual Hours of Operation After Retrofit"},"Annual kWh After Retrofit",null,null,null,null,"Total Rebate","unadjusted kWh Reduction","Interactive Effects","adjusted Early Replacement kWh Reduction","adjusted ROB kWh Reduction","Coincident Demand Factor","Interactive Effects","Early Replacement kW Demand Reduction","ROB kWDemand Reduction","Measure Life","Wattage Reduction","% of Total Watt Reduction","Weighted life"]
[{"$f":"'Project Details'!C17","v":0},{"$f":"'Project Details'!E17","v":0},{"$f":"'Project Details'!G17","v":0},{"$f":"'Project Details'!H17","v":0},{"$f":"'Project Details'!I17","v":0},null,null,{"$f":"'Project Details'!K17","v":""},{"$f":"IF(ISERROR(D4*E4*H4/1000),0,D4*E4*H4/1000)","v":0},{"$f":"'Project Details'!L17","v":0},{"$f":"'Project Details'!M17","v":0},{"$f":"'Project Details'!O17","v":0},{"$f":"'Project Details'!P17","v":0},null,null,{"$f":"'Project Details'!R17","v":""},{"$f":"IF(ISERROR(L4*M4*P4/1000),0,L4*M4*P4/1000)","v":0},null,null,null,null,{"$f":"IF(ISERROR(Y4*0.2),0,Y4*0.15)","v":0},{"$f":"IF(ISERROR(I4-Q4),0,I4-Q4)","v":0},{"$f":"IF(ISERROR(VLOOKUP('Project Details'!$L$13,CDF_IE,3,FALSE)),0,VLOOKUP('Project Details'!$L$13,CDF_IE,3,FALSE))","v":0},{"$f":"IF(ISERROR(W4*X4),0,W4*X4)","v":0},{"$f":"Y4*0.5","v":0},{"$f":"IF(ISERROR(VLOOKUP('Project Details'!$L$13,CDF_IE,2,FALSE)),0,VLOOKUP('Project Details'!$L$13,CDF_IE,2,FALSE))","v":0},{"$f":"IF(ISERROR(VLOOKUP('Project Details'!$L$13,CDF_IE,4,FALSE)),0,VLOOKUP('Project Details'!$L$13,CDF_IE,4,FALSE))","v":0},{"$f":"IF(ISERROR((AF4/1000)*AA4*AB4),0,(AF4/1000)*AA4*AB4)","v":0},{"$f":"AC4*0.5","v":0},{"$f":"IF(IF(ISERROR(VLOOKUP(J4,FIXTURE_TYPE,2,FALSE)),0,VLOOKUP(J4,FIXTURE_TYPE,2,FALSE))>15,15,IF(ISERROR(VLOOKUP(J4,FIXTURE_TYPE,2,FALSE)),0,VLOOKUP(J4,FIXTURE_TYPE,2,FALSE)))","v":0},{"$f":"IF(ISERROR(IF(S4=\"Lamp\",(D4*G4)-(L4*O4),(D4*E4)-(L4*M4))),0,IF(S4=\"Lamp\",(D4*G4)-(L4*O4),(D4*E4)-(L4*M4)))","v":0},{"$f":"IF(ISERROR(AF4/SUM($AF$4:$AF$38)),0,AF4/SUM($AF$4:$AF$38))","v":0},{"$f":"IF(ISERROR(AE4*AG4),0,AE4*AG4)","v":0}]
[{"$f":"'Project Details'!C18","v":0},{"$f":"'Project Details'!E18","v":0},{"$f":"'Project Details'!G18","v":0},{"$f":"'Project Details'!H18","v":0},{"$f":"'Project Details'!I18","v":0},null,null,{"$f":"'Project Details'!K18","v":""},{"$f":"IF(ISERROR(D5*E5*H5/1000),0,D5*E5*H5/1000)","v":0},{"$f":"'Project Details'!L18","v":0},{"$f":"'Project Details'!M18","v":0},{"$f":"'Project Details'!O18","v":0},{"$f":"'Project Details'!P18","v":0},null,null,{"$f":"'Project Details'!R18","v":""},{"$f":"IF(ISERROR(L5*M5*P5/1000),0,L5*M5*P5/1000)","v":0},null,null,null,null,{"$f":"IF(ISERROR(Y5*0.2),0,Y5*0.15)","v":0},{"$f":"IF(ISERROR(I5-Q5),0,I5-Q5)","v":0},{"$f":"IF(ISERROR(VLOOKUP('Project Details'!$L$13,CDF_IE,3,FALSE)),0,VLOOKUP('Project Details'!$L$13,CDF_IE,3,FALSE))","v":0},0,{"$f":"Y5*0.5","v":0},{"$f":"IF(ISERROR(VLOOKUP('Project Details'!$L$13,CDF_IE,2,FALSE)),0,VLOOKUP('Project Details'!$L$13,CDF_IE,2,FALSE))","v":0},{"$f":"IF(ISERROR(VLOOKUP('Project Details'!$L$13,CDF_IE,4,FALSE)),0,VLOOKUP('Project Details'!$L$13,CDF_IE,4,FALSE))","v":0},0,{"$f":"AC5*0.5","v":0},0,0,{"$f":"IF(ISERROR(AF5/SUM($AF$4:$AF$38)),0,AF5/SUM($AF$4:$AF$38))","v":0},0]
[{"$f":"'Project Details'!C19","v":0},{"$f":"'Project Details'!E19","v":0},{"$f":"'Project Details'!G19","v":0},{"$f":"'Project Details'!H19","v":0},{"$f":"'Project Details'!I19","v":0},null,null,{"$f":"'Project Details'!K19","v":""},0,{"$f":"'Project Details'!L19","v":0},{"$f":"'Project Details'!M19","v":0},{"$f":"'Project Details'!O19","v":0},{"$f":"'Project Details'!P19","v":0},null,null,{"$f":"'Project Details'!R19","v":""},0,null,null,null,null,0,0,{"$f":"IF(ISERROR(VLOOKUP('Project Details'!$L$13,CDF_IE,3,FALSE)),0,VLOOKUP('Project Details'!$L$13,CDF_IE,3,FALSE))","v":0},0,0,{"$f":"IF(ISERROR(VLOOKUP('Project Details'!$L$13,CDF_IE,2,FALSE)),0,VLOOKUP('Project Details'!$L$13,CDF_IE,2,FALSE))","v":0},{"$f":"IF(ISERROR(VLOOKUP('Project Details'!$L$13,CDF_IE,4,FALSE)),0,VLOOKUP('Project Details'!$L$13,CDF_IE,4,FALSE))","v":0},0,0,0,0,0,0]
[{"$f":"'Project Details'!C20","v":0},{"$f":"'Project Details'!E20","v":0},{"$f":"'Project Details'!G20","v":0},{"$f":"'Project Details'!H20","v":0},{"$f":"'Project Details'!I20","v":0},null,null,{"$f":"'Project Details'!K20","v":""},0,{"$f":"'Project Details'!L20","v":0},{"$f":"'Project Details'!M20","v":0},{"$f":"'Project Details'!O20","v":0},{"$f":"'Project Details'!P20","v":0},null,null,{"$f":"'Project Details'!R20","v":""},0,null,null,null,null,0,0,{"$f":"IF(ISERROR(VLOOKUP('Project Details'!$L$13,CDF_IE,3,FALSE)),0,VLOOKUP('Project Details'!$L$13,CDF_IE,3,FALSE))","v":0},0,0,{"$f":"IF(ISERROR(VLOOKUP('Project Details'!$L$13,CDF_IE,2,FALSE)),0,VLOOKUP('Project Details'!$L$13,CDF_IE,2,FALSE))","v":0},{"$f":"IF(ISERROR(VLOOKUP('Project Details'!$L$13,CDF_IE,4,FALSE)),0,VLOOKUP('Project Details'!$L$13,CDF_IE,4,FALSE))","v":0},0,0,0,0,0,0]
[{"$f":"'Project Details'!C21","v":0},{"$f":"'Project Details'!E21","v":0},{"$f":"'Project Details'!G21","v":0},{"$f":"'Project Details'!H21","v":0},{"$f":"'Project Details'!I21","v":0},null,null,{"$f":"'Project Details'!K21","v":""},0,{"$f":"'Project Details'!L21","v":0},{"$f":"'Project Details'!M21","v":0},{"$f":"'Project Details'!O21","v":0},{"$f":"'Project Details'!P21","v":0},null,null,{"$f":"'Project Details'!R21","v":""},0,null,null,null,null,0,0,{"$f":"IF(ISERROR(VLOOKUP('Project Details'!$L$13,CDF_IE,3,FALSE)),0,VLOOKUP('Project Details'!$L$13,CDF_IE,3,FALSE))","v":0},0,0,{"$f":"IF(ISERROR(VLOOKUP('Project Details'!$L$13,CDF_IE,2,FALSE)),0,VLOOKUP('Project Details'!$L$13,CDF_IE,2,FALSE))","v":0},{"$f":"IF(ISERROR(VLOOKUP('Project Details'!$L$13,CDF_IE,4,FALSE)),0,VLOOKUP('Project Details'!$L$13,CDF_IE,4,FALSE))","v":0},0,0,0,0,0,0]
[{"$f":"'Project Details'!C22","v":0},{"$f":"'Project Details'!E22","v":0},{"$f":"'Project Details'!G22","v":0},{"$f":"'Project Details'!H22","v":0},{"$f":"'Project Details'!I22","v":0},null,null,{"$f":"'Project Details'!K22","v":""},0,{"$f":"'Project Details'!L22","v":0},{"$f":"'Project Details'!M22","v":0},{"$f":"'Project Details'!O22","v":0},{"$f":"'Project Details'!P22","v":0},null,null,{"$f":"'Project Details'!R22","v":""},0,null,null,null,null,0,0,{"$f":"IF(ISERROR(VLOOKUP('Project Details'!$L$13,CDF_IE,3,FALSE)),0,VLOOKUP('Project Details'!$L$13,CDF_IE,3,FALSE))","v":0},0,0,{"$f":"IF(ISERROR(VLOOKUP('Project Details'!$L$13,CDF_IE,2,FALSE)),0,VLOOKUP('Project Details'!$L$13,CDF_IE,2,FALSE))","v":0},{"$f":"IF(ISERROR(VLOOKUP('Project Details'!$L$13,CDF_IE,4,FALSE)),0,VLOOKUP('Project Details'!$L$13,CDF_IE,4,FALSE))","v":0},0,0,0,0,0,0]
[{"$f":"'Project Details'!C23","v":0},{"$f":"'Project Details'!E23","v":0},{"$f":"'Project Details'!G23","v":0},{"$f":"'Project Details'!H23","v":0},{"$f":"'Project Details'!I23","v":0},null,null,{"$f":"'Project Details'!K23","v":""},0,{"$f":"'Project Details'!L23","v":0},{"$f":"'Project Details'!M23","v":0},{"$f":"'Project Details'!O23","v":0},{"$f":"'Project Details'!P23","v":0},null,null,{"$f":"'Project Details'!R23","v":""},0,null,null,null,null,0,0,{"$f":"IF(ISERROR(VLOOKUP('Project Details'!$L$13,CDF_IE,3,FALSE)),0,VLOOKUP('Project Details'!$L$13,CDF_IE,3,FALSE))","v":0},0,0,{"$f":"IF(ISERROR(VLOOKUP('Project Details'!$L$13,CDF_IE,2,FALSE)),0,VLOOKUP('Project Details'!$L$13,CDF_IE,2,FALSE))","v":0},{"$f":"IF(ISERROR(VLOOKUP('Project Details'!$L$13,CDF_IE,4,FALSE)),0,VLOOKUP('Project Details'!$L$13,CDF_IE,4,FALSE))","v":0},0,0,0,0,0,0]
[{"$f":"'Project Details'!C24","v":0},{"$f":"'Project Details'!E24","v":0},{"$f":"'Project Details'!G24","v":0},{"$f":"'Project Details'!H24","v":0},{"$f":"'Project Details'!I24","v":0},null,null,{"$f":"'Project Details'!K24","v":""},0,{"$f":"'Project Details'!L24","v":0},{"$f":"'Project Details'!M24","v":0},{"$f":"'Project Details'!O24","v":0},{"$f":"'Project Details'!P24","v":0},null,null,{"$f":"'Project Details'!R24","v":""},0,null,null,null,null,0,0,{"$f":"IF(ISERROR(VLOOKUP('Project Details'!$L$13,CDF_IE,3,FALSE)),0,VLOOKUP('Project Details'!$L$13,CDF_IE,3,FALSE))","v":0},0,0,{"$f":"IF(ISERROR(VLOOKUP('Project Details'!$L$13,CDF_IE,2,FALSE)),0,VLOOKUP('Project Details'!$L$13,CDF_IE,2,FALSE))","v":0},{"$f":"IF(ISERROR(VLOOKUP('Project Details'!$L$13,CDF_IE,4,FALSE)),0,VLOOKUP('Project Details'!$L$13,CDF_IE,4,FALSE))","v":0},0,0,0,0,0,0]
[{"$f":"'Project Details'!C25","v":0},{"$f":"'Project Details'!E25","v":0},{"$f":"'Project Details'!G25","v":0},{"$f":"'Project Details'!H25","v":0},{"$f":"'Project Details'!I25","v":0},null,null,{"$f":"'Project Details'!K25","v":""},0,{"$f":"'Project Details'!L25","v":0},{"$f":"'Project Details'!M25","v":0},{"$f":"'Project Details'!O25","v":0},{"$f":"'Project Details'!P25","v":0},null,null,{"$f":"'Project Details'!R25","v":""},0,null,null,null,null,0,0,{"$f":"IF(ISERROR(VLOOKUP('Project Details'!$L$13,CDF_IE,3,FALSE)),0,VLOOKUP('Project Details'!$L$13,CDF_IE,3,FALSE))","v":0},0,0,{"$f":"IF(ISERROR(VLOOKUP('Project Details'!$L$13,CDF_IE,2,FALSE)),0,VLOOKUP('Project Details'!$L$13,CDF_IE,2,FALSE))","v":0},{"$f":"IF(ISERROR(VLOOKUP('Project Details'!$L$13,CDF_IE,4,FALSE)),0,VLOOKUP('Project Details'!$L$13,CDF_IE,4,FALSE))","v":0},0,0,0,0,0,0]
[{"$f":"'Project Details'!C26","v":0},{"$f":"'Project Details'!E26","v":0},{"$f":"'Project Details'!G26","v":0},{"$f":"'Project Details'!H26","v":0},{"$f":"'Project Details'!I26","v":0},null,null,{"$f":"'Project Details'!K26","v":""},0,{"$f":"'Project Details'!L26","v":0},{"$f":"'Project Details'!M26","v":0},{"$f":"'Project Details'!O26","v":0},{"$f":"'Project Details'!P26","v":0},null,null,{"$f":"'Project Details'!R26","v":""},0,null,null,null,null,0,0,{"$f":"IF(ISERROR(VLOOKUP('Project Details'!$L$13,CDF_IE,3,FALSE)),0,VLOOKUP('Project Details'!$L$13,CDF_IE,3,FALSE))","v":0},0,0,{"$f":"IF(ISERROR(VLOOKUP('Project Details'!$L$13,CDF_IE,2,FALSE)),0,VLOOKUP('Project Details'!$L$13,CDF_IE,2,FALSE))","v":0},{"$f":"IF(ISERROR(VLOOKUP('Project Details'!$L$13,CDF_IE,4,FALSE)),0,VLOOKUP('Project Details'!$L$13,CDF_IE,4,FALSE))","v":0},0,0,0,0,0,0]
[{"$f":"'Project Details'!C27","v":0},{"$f":"'Project Details'!E27","v":0},{"$f":"'Project Details'!G27","v":0},{"$f":"'Project Details'!H27","v":0},{"$f":"'Project Details'!I27","v":0},null,null,{"$f":"'Project Details'!K27","v":""},0,{"$f":"'Project Details'!L27","v":0},{"$f":"'Project Details'!M27","v":0},{"$f":"'Project Details'!O27","v":0},{"$f":"'Project Details'!P27","v":0},null,null,{"$f":"'Project Details'!R27","v":""},0,null,null,null,null,0,0,{"$f":"IF(ISERROR(VLOOKUP('Project Details'!$L$13,CDF_IE,3,FALSE)),0,VLOOKUP('Project Details'!$L$13,CDF_IE,3,FALSE))","v":0},0,0,{"$f":"IF(ISERROR(VLOOKUP('Project Details'!$L$13,CDF_IE,2,FALSE)),0,VLOOKUP('Project Details'!$L$13,CDF_IE,2,FALSE))","v":0},{"$f":"IF(ISERROR(VLOOKUP('Project Details'!$L$13,CDF_IE,4,FALSE)),0,VLOOKUP('Project Details'!$L$13,CDF_IE,4,FALSE))","v":0},0,0,0,0,0,0]
[{"$f":"'Project Details'!C28","v":0},{"$f":"'Project Details'!E28","v":0},{"$f":"'Project Details'!G28","v":0},{"$f":"'Project Details'!H28","v":0},{"$f":"'Project Details'!I28","v":0},null,null,{"$f":"'Project Details'!K28","v":""},0,{"$f":"'Project Details'!L28","v":0},{"$f":"'Project Details'!M28","v":0},{"$f":"'Project Details'!O28","v":0},{"$f":"'Project Details'!P28","v":0},null,null,{"$f":"'Project Details'!R28","v":""},0,null,null,null,null,0,0,{"$f":"IF(ISERROR(VLOOKUP('Project Details'!$L$13,CDF_IE,3,FALSE)),0,VLOOKUP('Project Details'!$L$13,CDF_IE,3,FALSE))","v":0},0,0,{"$f":"IF(ISERROR(VLOOKUP('Project Details'!$L$13,CDF_IE,2,FALSE)),0,VLOOKUP('Project Details'!$L$13,CDF_IE,2,FALSE))","v":0},{"$f":"IF(ISERROR(VLOOKUP('Project Details'!$L$13,CDF_IE,4,FALSE)),0,VLOOKUP('Project Details'!$L$13,CDF_IE,4,FALSE))","v":0},0,0,0,0,0,0]
{"$rows_left_out":24}
{"sheet":"Lookups","index":3,"n_rows":285,"n_cols":15,"rows_kept":285,"cut":false,"hidden":true,"merged":[]}
["ExistingLighitng","ExistingFixtureType2","ExistingFixtureType3","ExistingFixtureType4","ExistingFixtureType5","ExistingFixtureType6","ExistingFixtureType7","ExistingFixtureType8","ExistingFixtureType9","ExistingFixtureType10","ExistingFixtureType11"]
["Fluorescent","T8 4ft Normal Ballast","T8 4ft Low Ballast","T8 4ft High Ballast","T8/T12 All Other Lengths","T5 Lamp","CFL","Metal Halide","High Pressure Sodium","T12 Lamp","User Defined"]
["U-Tube, ES Lamp, EE Mag Ballast","Bi-level Stairwell, Hallway, and Garage Fixture w/ Occ Sensor, 2-lamp T8","Fluorescent, 48\" (1) 32W  T8, BF <0.85","Fluorescent, 48\" (2) 28W  T8, BF >1.1","Fluorescent, 18\" T8 Lamp","Fluorescent, (1) 46\", T5/HO Lamp, NBF","CFL, 10W, Quad, Mag Ballast","Metal Halide, (1) 20W Lamp, Electronic Ballast","High Pressure Sodium, (1) 35W Lamp","Fluorescent, 18\" T12 Lamp",{"$f":"Schedules!A27","v":0}]
["U-Tube, T8 Lamp","Fluorescent, 48\" (1) 25W T8, NBF","Fluorescent, 48\" (2) 25W  T8,  BF <0.85","Fluorescent, 48\" (2) 32W  T8, BF >1.1","Fluorescent, 24\" T8 Lamp","Fluorescent, (2) 46\", T5/HO Lamp, NBF","CFL, 13W, Mag Ballast","Metal Halide, (1) 22W Lamp, Electronic Ballast","High Pressure Sodium, (1) 50W Lamp","Fluorescent, 18\"  (2) T12 Lamps ",{"$f":"Schedules!A28","v":0}]
["U-Tube, 2 Lamps","Fluorescent, 48\" (1) 32W T8, NBF","Fluorescent, 48\" (2) 28W  T8,  BF <0.85","Fluorescent, 48\" (3) 25W  T8, BF >1.1","Fluorescent, 24\" (2) T8 Lamps","Fluorescent, (2) 46\", 54W T5 Lamp, NBF","CFL, 13W, Electronic Ballast","Metal Halide, (1) 39W Lamp, Electronic Ballast","High Pressure Sodium, (1) 70W Lamp","Fluorescent, 24\" T12 Lamp ",{"$f":"Schedules!A29","v":0}]
["U-Tube, 2 ES Lamps, EE Mag Ballast","Fluorescent, 48\" (2) 25W T8, 0.96-1.1","Fluorescent, 48\" (2) 32W  T8,  BF <0.85","Fluorescent, 48\" (3) 28W  T8, BF >1.1","Fluorescent, 24\" (3) T8 Lamps, BF 0.96-1.1","Fluorescent  (3) 46\"  54W T5/HO Lamp","CFL, 13W, Quad, 2-Lamp, Electronic  Ballast","Metal Halide, (2) 39W Lamp, Electronic Ballast","High Pressure Sodium, (1) 100W Lamp","Fluorescent, 24\" (2) T12 Lamps ",{"$f":"Schedules!A30","v":0}]
["U-Tube, 2 T8 Lamps","Fluorescent, 48\" (2) 25W T8, NBF","Fluorescent, 48\" (3) 25W  T8,  BF <0.85","Fluorescent, 48\" (3) 32W  T8, BF >1.1","Fluorescent, 24\" (4) T8 Lamps","Fluorescent  (4) 46\"  54W T5/HO Lamp","CFL, 13W, Quad, 2-Lamp, Mag Ballast","Metal Halide, (1) 50W Lamp, Electronic Ballast","High Pressure Sodium, (1) 150W Lamp","Fluorescent, 24\" (3) T12 Lamps ",{"$f":"Schedules!A31","v":0}]
["Circular Lamp, 6\" Diameter","Fluorescent, 48\" (2) 28W T8, 0.96-1.1","Fluorescent, 48\" (3) 28W  T8,  BF <0.85","Fluorescent, 48\" (4) 25W  T8, BF >1.1","Fluorescent, 36\" (2) T8 Lamps","Fluorescent  (6) 46\"  54W T5/HO Lamp","CFL, 13W, Quad, 3-Lamp Mag Ballast","Metal Halide, (1) 70W Lamp, Electronic Ballast","High Pressure Sodium, (1) 200W Lamp","Fluorescent, 24\" (4) T12 Lamps ",{"$f":"Schedules!A32","v":0}]
["Circular Lamp, 8\" Diameter","Fluorescent, 48\" (2) 28W T8, NBF","Fluorescent, 48\" (3) 32W  T8,  BF <0.85","Fluorescent, 48\" (4) 28W  T8, BF >1.1","Fluorescent, 60\" T8 Lamp, NBF","Fluorescent  (8) 46\"  54W T5 /HO Lamp","CFL, 15W, Quad, Mag Ballast","Metal Halide, (1) 100W Lamp, Electronic Ballast","High Pressure Sodium, (1) 250W Lamp","Fluorescent, 36\" (2) T12 Lamps ",{"$f":"Schedules!A33","v":0}]
["Circular Lamp, 12\" Diameter","Fluorescent, 48\" (2) 32W T8, 0.96-1.1","Fluorescent, 48\" (4) 25W  T8,  BF <0.85","Fluorescent, 48\" (4) 32W  T8, BF >1.1","Fluorescent, 60\", T8 Lamp, HO BF",null,"CFL, 16W, 2D Lamp","Metal Halide, (1) 150W Lamp, Electronic Ballast","High Pressure Sodium, (1) 310W Lamp","Fluorescent, 48\" T12 Lamp ",{"$f":"Schedules!A34","v":0}]
["Circular Lamp, 16\" Diameter","Fluorescent, 48\" (2) 32W T8, NBF","Fluorescent, 48\" (4) 28W  T8,  BF <0.85","Fluorescent, 48\" (6) 32W  T8, BF >1.1","Fluorescent, 60\", (2) T8 Lamps, VHLO BF",null,"CFL, 17W, Quad, Mag Ballast","Metal Halide, (1) 175W Lamp, Electronic Ballast","High Pressure Sodium, (1) 360W Lamp","Fluorescent, 48\" (2) T12 Lamps ",{"$f":"Schedules!A35","v":0}]
["Circular Lamp, 20W","Fluorescent, 48\" (3) 25W T8, 0.96-1.1","Fluorescent, 48\" (4) 32W  T8,  BF <0.85",null,"Fluorescent, 60\", T12 HO (Refrig. Display Case)",null,"CFL, 17W, Quad, 2-Lamp, Mag Ballast","Metal Halide, (1) 200W Lamp, Electronic Ballast","High Pressure Sodium, (1) 400W Lamp","Fluorescent, 48\" (3) T12 Lamps ",{"$f":"Schedules!A36","v":0}]
["Circular Lamp, 22W","Fluorescent, 48\" (3) 25W T8, NBF","Fluorescent, 48\" (6) 32W  T8,  BF <0.85",null,"Fluorescent, 60\" (2) T12 HO (Refrig. Display Case)",null,"CFL, 18W, Quad, Mag Ballast","Metal Halide, (1) 250W Lamp, Electronic Ballast","High Pressure Sodium, (1) 750W Lamp","Fluorescent, 48\" (4) T12 Lamps",{"$f":"Schedules!A37","v":0}]
["Circular Lamp, 32W","Fluorescent, 48\" (3) 28W T8, 0.96-1.1",null,null,"Fluorescent, 60\" (2) T8 Lamps",null,"CFL, 18W, Pin Base","Metal Halide, (1) 320W Lamp, Electronic Ballast","High Pressure Sodium, (1) 1000W Lamp","Fluorescent, 48\" (6) T12 Lamps",{"$f":"Schedules!A38","v":0}]
[null,"Fluorescent, 48\" (3) 28W T8, NBF",null,null,"Fluorescent, 60\" (4) T8 Lamps",null,"CFL, 18W,  Pin Base, Electronic Ballast","Metal Halide, (1) 350W Lamp, Electronic Ballast",null,"Fluorescent, 60\" T12 Lamp ",{"$f":"Schedules!A39","v":0}]
{"$rows_left_out":270}